Reaction Details
TargetMitogen-activated protein kinase 10
LigandBDBM50297455
Substrate/Competitorn/a
Meas. Tech.ChEMBL_586022 (CHEMBL1063579)
Ki 90±n/a nM
Citation Cao, JGao, HBemis, GSalituro, FLedeboer, MHarrington, EWilke, STaslimi, PPazhanisamy, SXie, XJacobs, MGreen, J Structure-based design and parallel synthesis of N-benzyl isatin oximes as JNK3 MAP kinase inhibitors. Bioorg Med Chem Lett19:2891-5 (2009) 
 
Mitogen-activated protein kinase 10
Name:Mitogen-activated protein kinase 10
Type:Enzyme
Mol. Mass.:52586.89
Organism:Homo sapiens (Human)
Description:n/a
Residue:464
BDBM50297455
NameBDBM50297455
Synonyms:1-((6-fluoro-4H-benzo[d][1,3]dioxin-8-yl)methyl)-3-(hydroxyimino)-6-methylindolin-2-one | CHEMBL551140
TypeSmall organic molecule
Emp. Form.C18H15FN2O4
Mol. Mass.342.3211
SMILESCc1ccc2C(N=O)C(=O)N(Cc3cc(F)cc4COCOc34)c2c1