Reaction Details
TargetMitogen-activated protein kinase 10
LigandBDBM50297470
Substrate/Competitorn/a
Meas. Tech.ChEMBL_586022 (CHEMBL1063579)
Ki 640±n/a nM
Citation Cao, JGao, HBemis, GSalituro, FLedeboer, MHarrington, EWilke, STaslimi, PPazhanisamy, SXie, XJacobs, MGreen, J Structure-based design and parallel synthesis of N-benzyl isatin oximes as JNK3 MAP kinase inhibitors. Bioorg Med Chem Lett19:2891-5 (2009) 
 
Mitogen-activated protein kinase 10
Name:Mitogen-activated protein kinase 10
Type:Enzyme
Mol. Mass.:52586.89
Organism:Homo sapiens (Human)
Description:n/a
Residue:464
BDBM50297470
NameBDBM50297470
Synonyms:1-((6-fluoro-4H-benzo[d][1,3]dioxin-8-yl)methyl)-3-(hydroxyimino)-6-nitroindolin-2-one | CHEMBL551341
TypeSmall organic molecule
Emp. Form.C17H12FN3O6
Mol. Mass.373.2921
SMILES[O-][N+](=O)c1ccc2C(N=O)C(=O)N(Cc3cc(F)cc4COCOc34)c2c1