Reaction Details
TargetMitogen-activated protein kinase 10
LigandBDBM50297472
Substrate/Competitorn/a
Meas. Tech.ChEMBL_586022 (CHEMBL1063579)
Ki 740±n/a nM
Citation Cao, JGao, HBemis, GSalituro, FLedeboer, MHarrington, EWilke, STaslimi, PPazhanisamy, SXie, XJacobs, MGreen, J Structure-based design and parallel synthesis of N-benzyl isatin oximes as JNK3 MAP kinase inhibitors. Bioorg Med Chem Lett19:2891-5 (2009) 
 
Mitogen-activated protein kinase 10
Name:Mitogen-activated protein kinase 10
Type:Enzyme
Mol. Mass.:52586.89
Organism:Homo sapiens (Human)
Description:n/a
Residue:464
BDBM50297472
NameBDBM50297472
Synonyms:5-chloro-1-((6-fluoro-4H-benzo[d][1,3]dioxin-8-yl)methyl)-3-(hydroxyimino)indolin-2-one | CHEMBL560344
TypeSmall organic molecule
Emp. Form.C17H12ClFN2O4
Mol. Mass.362.74
SMILESFc1cc(CN2C(=O)C(N=O)c3cc(Cl)ccc23)c2OCOCc2c1