Reaction Details
TargetMitogen-activated protein kinase 10
LigandBDBM50297474
Substrate/Competitorn/a
Meas. Tech.ChEMBL_586022 (CHEMBL1063579)
Ki 940±n/a nM
Citation Cao, JGao, HBemis, GSalituro, FLedeboer, MHarrington, EWilke, STaslimi, PPazhanisamy, SXie, XJacobs, MGreen, J Structure-based design and parallel synthesis of N-benzyl isatin oximes as JNK3 MAP kinase inhibitors. Bioorg Med Chem Lett19:2891-5 (2009) 
 
Mitogen-activated protein kinase 10
Name:Mitogen-activated protein kinase 10
Type:Enzyme
Mol. Mass.:52586.89
Organism:Homo sapiens (Human)
Description:n/a
Residue:464
BDBM50297474
NameBDBM50297474
Synonyms:3-(hydroxyimino)-1-(3-nitrobenzyl)indolin-2-one | CHEMBL564999
TypeSmall organic molecule
Emp. Form.C15H11N3O4
Mol. Mass.297.2655
SMILES[O-][N+](=O)c1cccc(CN2C(=O)C(N=O)c3ccccc23)c1