Reaction Details
TargetMitogen-activated protein kinase 10
LigandBDBM50297481
Substrate/Competitorn/a
Meas. Tech.ChEMBL_586022 (CHEMBL1063579)
Ki 2000±n/a nM
Citation Cao, JGao, HBemis, GSalituro, FLedeboer, MHarrington, EWilke, STaslimi, PPazhanisamy, SXie, XJacobs, MGreen, J Structure-based design and parallel synthesis of N-benzyl isatin oximes as JNK3 MAP kinase inhibitors. Bioorg Med Chem Lett19:2891-5 (2009) 
 
Mitogen-activated protein kinase 10
Name:Mitogen-activated protein kinase 10
Type:Enzyme
Mol. Mass.:52586.89
Organism:Homo sapiens (Human)
Description:n/a
Residue:464
BDBM50297481
NameBDBM50297481
Synonyms:1-((6-fluoro-4H-benzo[d][1,3]dioxin-8-yl)methyl)-3-(hydroxyimino)-2-oxoindoline-4-carbonitrile | CHEMBL554276
TypeSmall organic molecule
Emp. Form.C18H12FN3O4
Mol. Mass.353.304
SMILESFc1cc(CN2C(=O)C(N=O)c3c2cccc3C#N)c2OCOCc2c1