Reaction Details
TargetMitogen-activated protein kinase 10
LigandBDBM50297486
Substrate/Competitorn/a
Meas. Tech.ChEMBL_586022 (CHEMBL1063579)
Ki 5200±n/a nM
Citation Cao, JGao, HBemis, GSalituro, FLedeboer, MHarrington, EWilke, STaslimi, PPazhanisamy, SXie, XJacobs, MGreen, J Structure-based design and parallel synthesis of N-benzyl isatin oximes as JNK3 MAP kinase inhibitors. Bioorg Med Chem Lett19:2891-5 (2009) 
 
Mitogen-activated protein kinase 10
Name:Mitogen-activated protein kinase 10
Type:Enzyme
Mol. Mass.:52586.89
Organism:Homo sapiens (Human)
Description:n/a
Residue:464
BDBM50297486
NameBDBM50297486
Synonyms:3-(hydroxyimino)-1-(3-(trifluoromethyl)benzyl)indolin-2-one | CHEMBL559325
TypeSmall organic molecule
Emp. Form.C16H11F3N2O2
Mol. Mass.320.2659
SMILESFC(F)(F)c1cccc(CN2C(=O)C(N=O)c3ccccc23)c1