Reaction Details
TargetMitogen-activated protein kinase 10
LigandBDBM50297493
Substrate/Competitorn/a
Meas. Tech.ChEMBL_586022 (CHEMBL1063579)
Ki 8500±n/a nM
Citation Cao, JGao, HBemis, GSalituro, FLedeboer, MHarrington, EWilke, STaslimi, PPazhanisamy, SXie, XJacobs, MGreen, J Structure-based design and parallel synthesis of N-benzyl isatin oximes as JNK3 MAP kinase inhibitors. Bioorg Med Chem Lett19:2891-5 (2009) 
 
Mitogen-activated protein kinase 10
Name:Mitogen-activated protein kinase 10
Type:Enzyme
Mol. Mass.:52586.89
Organism:Homo sapiens (Human)
Description:n/a
Residue:464
BDBM50297493
NameBDBM50297493
Synonyms:1-(2-fluorobenzyl)-3-(hydroxyimino)indolin-2-one | CHEMBL562974
TypeSmall organic molecule
Emp. Form.C15H11FN2O2
Mol. Mass.270.2584
SMILESFc1ccccc1CN1C(=O)C(N=O)c2ccccc12