Reaction Details
TargetMitogen-activated protein kinase 10
LigandBDBM50297495
Substrate/Competitorn/a
Meas. Tech.ChEMBL_586022 (CHEMBL1063579)
Ki 12000±n/a nM
Citation Cao, JGao, HBemis, GSalituro, FLedeboer, MHarrington, EWilke, STaslimi, PPazhanisamy, SXie, XJacobs, MGreen, J Structure-based design and parallel synthesis of N-benzyl isatin oximes as JNK3 MAP kinase inhibitors. Bioorg Med Chem Lett19:2891-5 (2009) 
 
Mitogen-activated protein kinase 10
Name:Mitogen-activated protein kinase 10
Type:Enzyme
Mol. Mass.:52586.89
Organism:Homo sapiens (Human)
Description:n/a
Residue:464
BDBM50297495
NameBDBM50297495
Synonyms:1-benzyl-5-chloro-3-(hydroxyimino)indolin-2-one | CHEMBL572133
TypeSmall organic molecule
Emp. Form.C15H11ClN2O2
Mol. Mass.286.713
SMILESClc1ccc2N(Cc3ccccc3)C(=O)C(N=O)c2c1