Reaction Details
TargetTyrosine-protein kinase JAK3
LigandBDBM50297455
Substrate/Competitorn/a
Meas. Tech.ChEMBL_586031 (CHEMBL1063588)
Ki>30000±n/a nM
Citation Cao, JGao, HBemis, GSalituro, FLedeboer, MHarrington, EWilke, STaslimi, PPazhanisamy, SXie, XJacobs, MGreen, J Structure-based design and parallel synthesis of N-benzyl isatin oximes as JNK3 MAP kinase inhibitors. Bioorg Med Chem Lett19:2891-5 (2009) 
 
Tyrosine-protein kinase JAK3
Name:Tyrosine-protein kinase JAK3
Type:Protein
Mol. Mass.:125111.08
Organism:Homo sapiens (Human)
Description:P52333
Residue:1124
BDBM50297455
NameBDBM50297455
Synonyms:1-((6-fluoro-4H-benzo[d][1,3]dioxin-8-yl)methyl)-3-(hydroxyimino)-6-methylindolin-2-one | CHEMBL551140
TypeSmall organic molecule
Emp. Form.C18H15FN2O4
Mol. Mass.342.3211
SMILESCc1ccc2C(N=O)C(=O)N(Cc3cc(F)cc4COCOc34)c2c1