Reaction Details
TargetMitogen-activated protein kinase 1
LigandBDBM50297496
Substrate/Competitorn/a
Meas. Tech.ChEMBL_586024 (CHEMBL1063581)
Ki>15000±n/a nM
Citation Cao, JGao, HBemis, GSalituro, FLedeboer, MHarrington, EWilke, STaslimi, PPazhanisamy, SXie, XJacobs, MGreen, J Structure-based design and parallel synthesis of N-benzyl isatin oximes as JNK3 MAP kinase inhibitors. Bioorg Med Chem Lett19:2891-5 (2009) 
 
Mitogen-activated protein kinase 1
Name:Mitogen-activated protein kinase 1
Type:Ser/Thr Protein Kinase
Mol. Mass.:41392.76
Organism:Homo sapiens (Human)
Description:P28482
Residue:360
BDBM50297496
NameBDBM50297496
Synonyms:CHEMBL559687 | methyl 1-((6-fluoro-4H-benzo[d][1,3]dioxin-8-yl)methyl)-3-(hydroxyimino)-2-oxoindoline-4-carboxylate
TypeSmall organic molecule
Emp. Form.C19H15FN2O6
Mol. Mass.386.3306
SMILESCOC(=O)c1cccc2N(Cc3cc(F)cc4COCOc34)C(=O)C(N=O)c12