Reaction Details
TargetDelta-type opioid receptor
LigandBDBM50297505
Substrate/Competitorn/a
Meas. Tech.ChEMBL_586039 (CHEMBL1063596)
Ki 5.2±n/a nM
Citation Pelotte, ALSmith, RMAyestas, MDersch, CMBilsky, EJRothman, RBDeveau, AM Design, synthesis, and characterization of 6beta-naltrexol analogs, and their selectivity for in vitro opioid receptor subtypes. Bioorg Med Chem Lett19:2811-4 (2009) 
 
Delta-type opioid receptor
Name:Delta-type opioid receptor
Type:G Protein-Coupled Receptor (GPCR)
Mol. Mass.:40382.98
Organism:Homo sapiens (Human)
Description:Competition binding assays were carried out using membrane preparations from transfected HN9.10 cells that constitutively expressed the delta opioid receptor.
Residue:372
BDBM50297505
NameBDBM50297505
Synonyms:CHEMBL563988 | l7-(cyclopropylmethyl)-3,l4-dihydroxy-6beta-(((4-methylphenyl)sulfonyl)oxy)-4,5alpha-epoxymorphinan
TypeSmall organic molecule
Emp. Form.C27H31NO6S
Mol. Mass.497.603
SMILESCc1ccc(cc1)S(=O)(=O)O[C@@H]1CC[C@@]2(O)[C@H]3Cc4ccc(O)c5O[C@@H]1[C@]2(CCN3CC1CC1)c45