Reaction Details
TargetKappa-type opioid receptor
LigandBDBM50297503
Substrate/Competitorn/a
Meas. Tech.ChEMBL_586040 (CHEMBL1063597)
Ki 15±n/a nM
Citation Pelotte, ALSmith, RMAyestas, MDersch, CMBilsky, EJRothman, RBDeveau, AM Design, synthesis, and characterization of 6beta-naltrexol analogs, and their selectivity for in vitro opioid receptor subtypes. Bioorg Med Chem Lett19:2811-4 (2009) 
 
Kappa-type opioid receptor
Name:Kappa-type opioid receptor
Type:G Protein-Coupled Receptor (GPCR)
Mol. Mass.:42648.76
Organism:Homo sapiens (Human)
Description:P41145
Residue:380
BDBM50297503
NameBDBM50297503
Synonyms:17-(cyclopropylmethyl)-3,14-dihydroxy-6beta-(N,N-diphenylcarbamate)-4,5alpha-epoxymorphinan | CHEMBL554617
TypeSmall organic molecule
Emp. Form.C33H34N2O5
Mol. Mass.538.6335
SMILESOc1ccc2C[C@H]3N(CC4CC4)CC[C@@]45[C@@H](Oc1c24)[C@@H](CC[C@@]35O)OC(=O)N(c1ccccc1)c1ccccc1