Reaction Details
TargetMu-type opioid receptor
LigandBDBM50297504
Substrate/Competitorn/a
Meas. Tech.ChEMBL_586038 (CHEMBL1063595)
Ki 1.9±n/a nM
Citation Pelotte, ALSmith, RMAyestas, MDersch, CMBilsky, EJRothman, RBDeveau, AM Design, synthesis, and characterization of 6beta-naltrexol analogs, and their selectivity for in vitro opioid receptor subtypes. Bioorg Med Chem Lett19:2811-4 (2009) 
 
Mu-type opioid receptor
Name:Mu-type opioid receptor
Type:G Protein-Coupled Receptor (GPCR)
Mol. Mass.:44789.51
Organism:Homo sapiens (Human)
Description:P35372
Residue:400
BDBM50297504
NameBDBM50297504
Synonyms:17-(cyclopropylmethyl)-3,14-dihydroxy-6beta-(N,N-dimethylcarbamate)-4,5alpha-epoxymorphinan | CHEMBL560200
TypeSmall organic molecule
Emp. Form.C23H30N2O5
Mol. Mass.414.4947
SMILESCN(C)C(=O)O[C@@H]1CC[C@@]2(O)[C@H]3Cc4ccc(O)c5O[C@@H]1[C@]2(CCN3CC1CC1)c45