Reaction Details
TargetKappa-type opioid receptor
LigandBDBM50297506
Substrate/Competitorn/a
Meas. Tech.ChEMBL_586040 (CHEMBL1063597)
Ki 6.8±n/a nM
Citation Pelotte, ALSmith, RMAyestas, MDersch, CMBilsky, EJRothman, RBDeveau, AM Design, synthesis, and characterization of 6beta-naltrexol analogs, and their selectivity for in vitro opioid receptor subtypes. Bioorg Med Chem Lett19:2811-4 (2009) 
 
Kappa-type opioid receptor
Name:Kappa-type opioid receptor
Type:G Protein-Coupled Receptor (GPCR)
Mol. Mass.:42648.76
Organism:Homo sapiens (Human)
Description:P41145
Residue:380
BDBM50297506
NameBDBM50297506
Synonyms:CHEMBL551074 | l7-(cyclopropylmethyl)-3,l4-dihydroxy-6beta-((methylsulfonyl)oxy)-4,5alpha-epoxymorphinan
TypeSmall organic molecule
Emp. Form.C21H27NO6S
Mol. Mass.421.507
SMILESCS(=O)(=O)O[C@@H]1CC[C@@]2(O)[C@H]3Cc4ccc(O)c5O[C@@H]1[C@]2(CCN3CC1CC1)c45