Reaction Details
TargetCannabinoid receptor 2
LigandBDBM50297601
Substrate/Competitorn/a
Meas. Tech.ChEMBL_583691 (CHEMBL1061737)
EC50 320±n/a nM
Citation Ryckmans, TEdwards, MPHorne, VACorreia, AMOwen, DRThompson, LRTran, ITutt, MFYoung, T Rapid assessment of a novel series of selective CB(2) agonists using parallel synthesis protocols: A Lipophilic Efficiency (LipE) analysis. Bioorg Med Chem Lett19:4406-9 (2009) 
 
Cannabinoid receptor 2
Name:Cannabinoid receptor 2
Type:G Protein-Coupled Receptor (GPCR)
Mol. Mass.:39690.94
Organism:Homo sapiens (Human)
Description:P34972
Residue:360
BDBM50297601
NameBDBM50297601
Synonyms:1-(2-tert-butyl-1-(cyclopropylmethyl)-6,7-dihydro-1H-imidazo[4,5-c]pyridin-5(4H)-yl)-2,2-dimethylpropan-1-one | CHEMBL560608
TypeSmall organic molecule
Emp. Form.C19H31N3O
Mol. Mass.317.4689
SMILESCC(C)(C)C(=O)N1CCc2c(C1)nc(n2CC1CC1)C(C)(C)C