Reaction Details
TargetCannabinoid receptor 1
LigandBDBM50297597
Substrate/Competitorn/a
Meas. Tech.ChEMBL_583693 (CHEMBL1061739)
EC50 7500±n/a nM
Citation Ryckmans, TEdwards, MPHorne, VACorreia, AMOwen, DRThompson, LRTran, ITutt, MFYoung, T Rapid assessment of a novel series of selective CB(2) agonists using parallel synthesis protocols: A Lipophilic Efficiency (LipE) analysis. Bioorg Med Chem Lett19:4406-9 (2009) 
 
Cannabinoid receptor 1
Name:Cannabinoid receptor 1
Type:G Protein-Coupled Receptor (GPCR)
Mol. Mass.:52868.96
Organism:Homo sapiens (Human)
Description:P21554
Residue:472
BDBM50297597
NameBDBM50297597
Synonyms:4-(2-tert-butyl-1-(cyclopropylmethyl)-6,7-dihydro-1H-imidazo[4,5-c]pyridin-5(4H)-ylsulfonyl)-3,5-dimethylisoxazole | CHEMBL562150
TypeSmall organic molecule
Emp. Form.C19H28N4O3S
Mol. Mass.392.516
SMILESCc1noc(C)c1S(=O)(=O)N1CCc2c(C1)nc(n2CC1CC1)C(C)(C)C