Reaction Details
TargetC-X-C chemokine receptor type 1
LigandBDBM50297739
Substrate/Competitorn/a
Meas. Tech.ChEMBL_584048 (CHEMBL1055928)
Ki>1000±n/a nM
Citation Aki, CChao, JFerreira, JADwyer, MPYu, YChao, JMerritt, RJLai, GWu, MHipkin, RWFan, XGonsiorek, WFosseta, JRindgen, DFine, JLundell, DTaveras, AGBiju, P Diaminocyclobutenediones as potent and orally bioavailable CXCR2 receptor antagonists: SAR in the phenolic amide region. Bioorg Med Chem Lett19:4446-9 (2009) 
 
C-X-C chemokine receptor type 1
Name:C-X-C chemokine receptor type 1
Type:Enzyme
Mol. Mass.:39803.83
Organism:Homo sapiens (Human)
Description:P25024
Residue:350
BDBM50297739
NameBDBM50297739
Synonyms:(R)-3-(3,4-dioxo-2-(1-phenylpropylamino)cyclobut-1-enylamino)-2-hydroxy-N,N-dimethyl-6-(pyridin-2-yl)benzamide | CHEMBL550130
TypeSmall organic molecule
Emp. Form.C27H26N4O4
Mol. Mass.470.5197
SMILESCC[C@@H](Nc1c(Nc2ccc(-c3ccccn3)c(C(=O)N(C)C)c2O)c(=O)c1=O)c1ccccc1