Reaction Details
TargetC-X-C chemokine receptor type 2
LigandBDBM50297743
Substrate/Competitorn/a
Meas. Tech.ChEMBL_584049 (CHEMBL1055929)
Ki 61±n/a nM
Citation Aki, CChao, JFerreira, JADwyer, MPYu, YChao, JMerritt, RJLai, GWu, MHipkin, RWFan, XGonsiorek, WFosseta, JRindgen, DFine, JLundell, DTaveras, AGBiju, P Diaminocyclobutenediones as potent and orally bioavailable CXCR2 receptor antagonists: SAR in the phenolic amide region. Bioorg Med Chem Lett19:4446-9 (2009) 
 
C-X-C chemokine receptor type 2
Name:C-X-C chemokine receptor type 2
Type:Protein
Mol. Mass.:40767.88
Organism:Homo sapiens (Human)
Description:P25025
Residue:360
BDBM50297743
NameBDBM50297743
Synonyms:(R)-5-bromo-3-(3,4-dioxo-2-(1-(thiophen-2-yl)propylamino)cyclobut-1-enylamino)-2-hydroxy-N,N-dimethylbenzamide | CHEMBL562950
TypeSmall organic molecule
Emp. Form.C20H20BrN3O4S
Mol. Mass.478.359
SMILESCC[C@@H](Nc1c(Nc2cc(Br)cc(C(=O)N(C)C)c2O)c(=O)c1=O)c1cccs1