Reaction Details
TargetcGMP-specific 3',5'-cyclic phosphodiesterase
LigandBDBM50297814
Substrate/Competitorn/a
Meas. Tech.ChEMBL_584078 (CHEMBL1058319)
IC50 27±n/a nM
Citation Owen, DRWalker, JKJon Jacobsen, EFreskos, JNHughes, ROBrown, DLBell, ASBrown, DGPhillips, CMischke, BVMolyneaux, JMFobian, YMHeasley, SEMoon, JBStallings, WCJoseph Rogier, DFox, DNPalmer, MJRinger, TRodriquez-Lens, MCubbage, JWBlevis-Bal, RMBenson, AGAcker, BAMaddux, TMTollefson, MBBond, BRMacinnes, AYu, Y Identification, synthesis and SAR of amino substituted pyrido[3,2b]pyrazinones as potent and selective PDE5 inhibitors. Bioorg Med Chem Lett19:4088-91 (2009) 
 
cGMP-specific 3',5'-cyclic phosphodiesterase
Name:cGMP-specific 3',5'-cyclic phosphodiesterase
Type:Protein
Mol. Mass.:99975.83
Organism:Homo sapiens (Human)
Description:O76074
Residue:875
BDBM50297814
NameBDBM50297814
Synonyms:6-(2-methoxypyrimidin-5-yl)-2-(2-morpholinoethylamino)-4-(2-propoxyethyl)pyrido[2,3-b]pyrazin-3(4H)-one | CHEMBL562756
TypeSmall organic molecule
Emp. Form.C23H31N7O4
Mol. Mass.469.5367
SMILESCCCOCCn1c2nc(ccc2nc(NCCN2CCOCC2)c1=O)-c1cnc(OC)nc1