Reaction Details
TargetCytochrome P450 2D6
LigandBDBM50297869
Substrate/Competitorn/a
Meas. Tech.ChEMBL_584295 (CHEMBL1060929)
Ki 502±n/a nM
Citation Coon, TMoree, WJLi, BYu, JZamani-Kord, SMalany, SSantos, MAHernandez, LMPetroski, RESun, AWen, JSullivan, SHaelewyn, JHedrick, MHoare, SJBradbury, MJCrowe, PDBeaton, G Brain-penetrating 2-aminobenzimidazole H(1)-antihistamines for the treatment of insomnia. Bioorg Med Chem Lett19:4380-4 (2009) 
 
Cytochrome P450 2D6
Name:Cytochrome P450 2D6
Type:Protein
Mol. Mass.:55774.82
Organism:Homo sapiens (Human)
Description:P10635
Residue:497
BDBM50297869
NameBDBM50297869
Synonyms:1-(1-(4-fluorobenzyl)-1H-benzo[d]imidazol-2-yl)-N-methyl-N-phenethylpiperidin-4-amine | CHEMBL559557
TypeSmall organic molecule
Emp. Form.C28H31FN4
Mol. Mass.442.5709
SMILESCN(CCc1ccccc1)C1CCN(CC1)c1nc2ccccc2n1Cc1ccc(F)cc1