Reaction Details
TargetHistamine H1 receptor
LigandBDBM50297862
Substrate/Competitorn/a
Meas. Tech.ChEMBL_584293 (CHEMBL1060927)
Ki 2.4±n/a nM
Citation Coon, TMoree, WJLi, BYu, JZamani-Kord, SMalany, SSantos, MAHernandez, LMPetroski, RESun, AWen, JSullivan, SHaelewyn, JHedrick, MHoare, SJBradbury, MJCrowe, PDBeaton, G Brain-penetrating 2-aminobenzimidazole H(1)-antihistamines for the treatment of insomnia. Bioorg Med Chem Lett19:4380-4 (2009) 
 
Histamine H1 receptor
Name:Histamine H1 receptor
Type:G Protein-Coupled Receptor (GPCR)
Mol. Mass.:55808.72
Organism:Homo sapiens (Human)
Description:Cell pellets from SK-N-MC cells transfected with human H1 receptor were used in binding assay.
Residue:487
BDBM50297862
NameBDBM50297862
Synonyms:1-(1-(4-methoxybenzyl)-1H-benzo[d]imidazol-2-yl)-N,N-dimethylpiperidin-4-amine | CHEMBL558468
TypeSmall organic molecule
Emp. Form.C22H28N4O
Mol. Mass.364.4839
SMILESCOc1ccc(Cn2c(nc3ccccc23)N2CCC(CC2)N(C)C)cc1