Reaction Details
TargetSerine/threonine-protein kinase PLK1
LigandBDBM50297981
Substrate/Competitorn/a
Meas. Tech.ChEMBL_584622 (CHEMBL1059123)
IC50 12±n/a nM
Citation Sato, YOnozaki, YSugimoto, TKurihara, HKamijo, KKadowaki, CTsujino, TWatanabe, AOtsuki, SMitsuya, MIida, MHaze, KMachida, TNakatsuru, YKomatani, HKotani, HIwasawa, Y Imidazopyridine derivatives as potent and selective Polo-like kinase (PLK) inhibitors. Bioorg Med Chem Lett19:4673-8 (2009) 
 
Serine/threonine-protein kinase PLK1
Name:Serine/threonine-protein kinase PLK1
Type:Serine/threonine-protein kinase
Mol. Mass.:68277.16
Organism:Homo sapiens (Human)
Description:P53350
Residue:603
BDBM50297981
NameBDBM50297981
Synonyms:(R)-3-(1-(2-chloro-4-((3-oxopiperazin-1-yl)methyl)phenyl)ethoxy)-5-(imidazo[1,2-a]pyridin-3-yl)thiophene-2-carboxamide | CHEMBL550475
TypeSmall organic molecule
Emp. Form.C25H24ClN5O3S
Mol. Mass.510.008
SMILESC[C@@H](Oc1cc(sc1C(N)=O)-c1cnc2ccccn12)c1ccc(CN2CCNC(=O)C2)cc1Cl