Reaction Details
TargetRenin
LigandBDBM17950
Substrate/Competitorn/a
Meas. Tech.ChEMBL_585344 (CHEMBL1054383)
IC50 0.6±n/a nM
Citation Yamaguchi, YMenear, KCohen, NCMah, RCumin, FSchnell, CWood, JMMaibaum, J The P1N-isopropyl motif bearing hydroxyethylene dipeptide isostere analogues of aliskiren are in vitro potent inhibitors of the human aspartyl protease renin. Bioorg Med Chem Lett19:4863-7 (2009) 
 
Renin
Name:Renin
Type:Enzyme
Mol. Mass.:45058.99
Organism:Homo sapiens (Human)
Description:n/a
Residue:406
BDBM17950
NameBDBM17950
Synonyms:(2S,4S,5S,7S)-5-amino-N-(2-carbamoyl-2,2-dimethylethyl)-4-hydroxy-7-{[4-methoxy-3-(3-methoxypropoxy)phenyl]methyl}-8-methyl-2-(propan-2-yl)nonanamide Aliskiren CHEMBL1639 TEKTURNA
TypeSmall organic molecule
Emp. Form.C30H53N3O6
Mol. Mass.551.7583
SMILESCOCCCOc1cc(C[C@@H](C[C@H](N)[C@@H](O)C[C@@H](C(C)C)C(=O)NCC(C)(C)C(N)=O)C(C)C)ccc1OC