Reaction Details
TargetRenin
LigandBDBM50298191
Substrate/Competitorn/a
Meas. Tech.ChEMBL_585344 (CHEMBL1054383)
IC50 2±n/a nM
Citation Yamaguchi, YMenear, KCohen, NCMah, RCumin, FSchnell, CWood, JMMaibaum, J The P1N-isopropyl motif bearing hydroxyethylene dipeptide isostere analogues of aliskiren are in vitro potent inhibitors of the human aspartyl protease renin. Bioorg Med Chem Lett19:4863-7 (2009) 
 
Renin
Name:Renin
Type:Enzyme
Mol. Mass.:45058.99
Organism:Homo sapiens (Human)
Description:n/a
Residue:406
BDBM50298191
NameBDBM50298191
Synonyms:CHEMBL557063 | N-((2S,3S,5R)-2-amino-6-(butylamino)-3-hydroxy-5-methyl-6-oxohexyl)-N-isopropyl-4-methoxy-3-(3-methoxypropoxy)benzamide
TypeSmall organic molecule
Emp. Form.C26H45N3O6
Mol. Mass.495.652
SMILESCCCCNC(=O)[C@H](C)C[C@H](O)[C@@H](N)CN(C(C)C)C(=O)c1ccc(OC)c(OCCCOC)c1