Reaction Details
TargetCarbonic anhydrase 9
LigandBDBM50298204
Substrate/Competitorn/a
Meas. Tech.ChEMBL_585509 (CHEMBL1060056)
Kd 3.2±n/a nM
Citation Ahlskog, JKDumelin, CETrüssel, SMårlind, JNeri, D In vivo targeting of tumor-associated carbonic anhydrases using acetazolamide derivatives. Bioorg Med Chem Lett19:4851-6 (2009) 
 
Carbonic anhydrase 9
Name:Carbonic anhydrase 9
Type:Enzyme
Mol. Mass.:49669.03
Organism:Homo sapiens (Human)
Description:Catalytic domain of human cloned isozyme was used in the assay
Residue:459
BDBM50298204
NameBDBM50298204
Synonyms:6-(4-(4-iodophenyl)butanamido)-2-(4-oxo-4-(5-sulfamoyl-1,3,4-thiadiazol-2-ylamino)butanamido)hexanoic acid | CHEMBL561947
TypeSmall organic molecule
Emp. Form.C22H29IN6O7S2
Mol. Mass.680.536
SMILESNS(=O)(=O)c1nnc(NC(=O)CCC(=O)NC(CCCCNC(=O)CCCc2ccc(I)cc2)C(O)=O)s1