Reaction Details
TargetProgesterone receptor
LigandBDBM50298212
Substrate/Competitorn/a
Meas. Tech.ChEMBL_585522 (CHEMBL1062686)
IC50 20±n/a nM
Citation Washburn, DGHoang, THFrazee, JSJohnson, LHammond, MManns, SMadauss, KPWilliams, SPDuraiswami, CTran, TBStewart, ELGrygielko, ETGlace, LETrizna, WNagilla, RBray, JDThompson, SK Discovery of orally active, pyrrolidinone-based progesterone receptor partial agonists. Bioorg Med Chem Lett19:4664-8 (2009) 
 
Progesterone receptor
Name:Progesterone receptor
Type:Protein
Mol. Mass.:98979.52
Organism:Homo sapiens (Human)
Description:P06401
Residue:933
BDBM50298212
NameBDBM50298212
Synonyms:(S)-2-chloro-4-((2-fluorobenzyl)(1-methyl-5-oxopyrrolidin-3-yl)amino)benzonitrile | CHEMBL563283
TypeSmall organic molecule
Emp. Form.C19H17ClFN3O
Mol. Mass.357.809
SMILESCN1C[C@H](CC1=O)N(Cc1ccccc1F)c1ccc(C#N)c(Cl)c1