Reaction Details
TargetTelomerase reverse transcriptase
LigandBDBM50298373
Substrate/Competitorn/a
Meas. Tech.ChEMBL_588495 (CHEMBL1041235)
IC50 5600±n/a nM
Citation Laronze-Cochard, MKim, YMBrassart, BRiou, JFLaronze, JYSapi, J Synthesis and biological evaluation of novel 4,5-bis(dialkylaminoalkyl)-substituted acridines as potent telomeric G-quadruplex ligands. Eur J Med Chem44:3880-8 (2009) 
 
Telomerase reverse transcriptase
Name:Telomerase reverse transcriptase
Type:PROTEIN
Mol. Mass.:127099.03
Organism:Homo sapiens (Human)
Description:ChEMBL_1447029
Residue:1132
BDBM50298373
NameBDBM50298373
Synonyms:4,5-Bis[2-(N,N-dimethylamino)ethylaminomethyl]acridine | CHEMBL574042
TypeSmall organic molecule
Emp. Form.C23H33N5
Mol. Mass.379.5416
SMILESCN(C)CCNCc1cccc2cc3cccc(CNCCN(C)C)c3nc12