Reaction Details
TargetTelomerase reverse transcriptase
LigandBDBM50298377
Substrate/Competitorn/a
Meas. Tech.ChEMBL_588495 (CHEMBL1041235)
IC50 12000±n/a nM
Citation Laronze-Cochard, MKim, YMBrassart, BRiou, JFLaronze, JYSapi, J Synthesis and biological evaluation of novel 4,5-bis(dialkylaminoalkyl)-substituted acridines as potent telomeric G-quadruplex ligands. Eur J Med Chem44:3880-8 (2009) 
 
Telomerase reverse transcriptase
Name:Telomerase reverse transcriptase
Type:PROTEIN
Mol. Mass.:127099.03
Organism:Homo sapiens (Human)
Description:ChEMBL_1447029
Residue:1132
BDBM50298377
NameBDBM50298377
Synonyms:CHEMBL576188 | N,N'-[4,5-Acridindiylbis(methylene)]bis[4-(1-piperidinyl)butanamide]
TypeSmall organic molecule
Emp. Form.C33H45N5O2
Mol. Mass.543.7427
SMILESO=C(CCCN1CCCCC1)NCc1cccc2cc3cccc(CNC(=O)CCCN4CCCCC4)c3nc12