Reaction Details
TargetRAC-alpha serine/threonine-protein kinase
LigandBDBM16968
Substrate/Competitorn/a
Meas. Tech.ChEMBL_587680 (CHEMBL1049250)
IC50 3.5±n/a nM
Citation Dong, XJiang, CHu, HYan, JChen, JHu, Y QSAR study of Akt/protein kinase B (PKB) inhibitors using support vector machine. Eur J Med Chem44:4090-7 (2009) 
 
RAC-alpha serine/threonine-protein kinase
Name:RAC-alpha serine/threonine-protein kinase
Type:Enzyme
Mol. Mass.:55681.25
Organism:Homo sapiens (Human)
Description:P31749
Residue:480
BDBM16968
NameBDBM16968
Synonyms:6-{5-[(2S)-2-amino-3-(1H-indol-3-yl)propoxy]pyridin-3-yl}-3-fluoroisoquinoline | Isoquinoline-pyridine, 10o
TypeSmall organic molecule
Emp. Form.C25H21FN4O
Mol. Mass.412.4588
SMILESN[C@H](COc1cncc(c1)-c1ccc2cnc(F)cc2c1)Cc1c[nH]c2ccccc12