Reaction Details
TargetCholecystokinin receptor type A
LigandBDBM50298572
Substrate/Competitorn/a
Meas. Tech.ChEMBL_587760 (CHEMBL1040411)
IC50 1200±n/a nM
Citation Hadjipavlou-Litina, DBraiuca, PLassiani, LPavan, MVVarnavas, A 2D-QSAR and 3D-QSAR/CoMFA analyses of the N-terminal substituted anthranilic acid based CCK(1) receptor antagonists: 'Hic Rhodus, hic saltus'. Bioorg Med Chem17:5198-206 (2009) 
 
Cholecystokinin receptor type A
Name:Cholecystokinin receptor type A
Type:Enzyme Catalytic Domain
Mol. Mass.:49676.37
Organism:RAT
Description:Cholecystokinin central 0 RAT::P30551
Residue:444
BDBM50298572
NameBDBM50298572
Synonyms:(+/-)-3-phenyl-2-(2-(4,5,6,7-tetrahydro-1H-indole-2-carboxamido)benzamido)propanoic acid | CHEMBL572650
TypeSmall organic molecule
Emp. Form.C25H25N3O4
Mol. Mass.431.4837
SMILESOC(=O)C(Cc1ccccc1)NC(=O)c1ccccc1NC(=O)c1cc2CCCCc2[nH]1