Reaction Details
TargetCholecystokinin receptor type A
LigandBDBM50298586
Substrate/Competitorn/a
Meas. Tech.ChEMBL_587760 (CHEMBL1040411)
IC50 1108±n/a nM
Citation Hadjipavlou-Litina, DBraiuca, PLassiani, LPavan, MVVarnavas, A 2D-QSAR and 3D-QSAR/CoMFA analyses of the N-terminal substituted anthranilic acid based CCK(1) receptor antagonists: 'Hic Rhodus, hic saltus'. Bioorg Med Chem17:5198-206 (2009) 
 
Cholecystokinin receptor type A
Name:Cholecystokinin receptor type A
Type:Enzyme Catalytic Domain
Mol. Mass.:49676.37
Organism:RAT
Description:Cholecystokinin central 0 RAT::P30551
Residue:444
BDBM50298586
NameBDBM50298586
Synonyms:(+/-)-2-(2-(1-methyl-5-nitro-1H-indole-2-carboxamido)benzamido)-3-phenylpropanoic acid | CHEMBL573793
TypeSmall organic molecule
Emp. Form.C26H22N4O6
Mol. Mass.486.4761
SMILESCn1c(cc2cc(ccc12)[N+]([O-])=O)C(=O)Nc1ccccc1C(=O)NC(Cc1ccccc1)C(O)=O