Reaction Details
TargetCholecystokinin receptor type A
LigandBDBM50298596
Substrate/Competitorn/a
Meas. Tech.ChEMBL_587760 (CHEMBL1040411)
IC50 1120±n/a nM
Citation Hadjipavlou-Litina, DBraiuca, PLassiani, LPavan, MVVarnavas, A 2D-QSAR and 3D-QSAR/CoMFA analyses of the N-terminal substituted anthranilic acid based CCK(1) receptor antagonists: 'Hic Rhodus, hic saltus'. Bioorg Med Chem17:5198-206 (2009) 
 
Cholecystokinin receptor type A
Name:Cholecystokinin receptor type A
Type:Enzyme Catalytic Domain
Mol. Mass.:49676.37
Organism:RAT
Description:Cholecystokinin central 0 RAT::P30551
Residue:444
BDBM50298596
NameBDBM50298596
Synonyms:(+/-)-2-(2-(benzo[b]thiophene-2-carboxamido)benzamido)-3-phenylpropanoic acid | CHEMBL575161
TypeSmall organic molecule
Emp. Form.C25H20N2O4S
Mol. Mass.444.502
SMILESOC(=O)C(Cc1ccccc1)NC(=O)c1ccccc1NC(=O)c1cc2ccccc2s1