Reaction Details
TargetP2X purinoceptor 7
LigandBDBM50087267
Substrate/Competitorn/a
Meas. Tech.ChEMBL_588017 (CHEMBL1048352)
IC50 300±n/a nM
Citation Gunosewoyo, HCoster, MJBennett, MRKassiou, M Purinergic P2X(7) receptor antagonists: Chemistry and fundamentals of biological screening. Bioorg Med Chem17:4861-5 (2009) 
 
P2X purinoceptor 7
Name:P2X purinoceptor 7
Type:Protein
Mol. Mass.:68602.85
Organism:Homo sapiens (Human)
Description:Q99572
Residue:595
BDBM50087267
NameBDBM50087267
Synonyms:(1-(N,O-bis(1,5-isoquinolinesulfonyl)-N-methyl-L-tyrosyl)-4phenylpiperazine) 1-(N,O-bis(1,5-isoquinolinesulfonyl)-N-methyl-L-tyrosyl)-4-phenylpiperazine Isoquinoline-5-sulfonic acid 4-[(S)-2-[(isoquinoline-5-sulfonyl)-methyl-amino]-3-oxo-3-(4-phenyl-piperazin-1-yl)-propyl]-phenyl ester [(1-[N,O-bis(5-isoquinolinesulphonyl)-N-methyl-Ltyrosyl]-4-phenylpiperazine)
TypeSmall organic molecule
Emp. Form.C38H35N5O6S2
Mol. Mass.721.844
SMILESCN([C@@H](Cc1ccc(OS(=O)(=O)c2cccc3cnccc23)cc1)C(=O)N1CCN(CC1)c1ccccc1)S(=O)(=O)c1cccc2cnccc12