Reaction Details
TargetRibonuclease pancreatic
LigandBDBM50298713
Substrate/Competitorn/a
Meas. Tech.ChEMBL_588021 (CHEMBL1048356)
Ki 80000±n/a nM
Citation Debnath, JDasgupta, SPathak, T Nucleoside-amino acid conjugates: An alternative route to the design of ribonuclease A inhibitors. Bioorg Med Chem17:4921-7 (2009) 
 
Ribonuclease pancreatic
Name:Ribonuclease pancreatic
Type:Enzyme
Mol. Mass.:16468.79
Organism:Bison bison (American bison)
Description:carboxamidomethylated RNase A
Residue:150
BDBM50298713
NameBDBM50298713
Synonyms:2',3'-Dideoxy-3'-L-serinylamino thymidine | CHEMBL574297
TypeSmall organic molecule
Emp. Form.C14H22N4O6
Mol. Mass.342.3477
SMILESCc1cn(C[C@H]2C[C@H](NC(=O)C(N)CO)[C@@H](CO)O2)c(=O)[nH]c1=O