Reaction Details
TargetProstate-specific antigen
LigandBDBM50298729
Substrate/Competitorn/a
Meas. Tech.ChEMBL_588029 (CHEMBL1048364)
Ki>100±n/a nM
Citation LeBeau, AMBanerjee, SRPomper, MGMease, RCDenmeade, SR Optimization of peptide-based inhibitors of prostate-specific antigen (PSA) as targeted imaging agents for prostate cancer. Bioorg Med Chem17:4888-93 (2009) 
 
Prostate-specific antigen
Name:Prostate-specific antigen
Type:PROTEIN
Mol. Mass.:28747.53
Organism:Homo sapiens (Human)
Description:ChEMBL_959198
Residue:261
BDBM50298729
NameBDBM50298729
Synonyms:CHEMBL574929 | benzyl(2S,5S,8S,11S,14S)-8-(4-aminobutyl)-14-formyl-1-hydroxy-11-((R)-1-hydroxyethyl)-5-(hydroxymethyl)-16-methyl-3,6,9,12-tetraoxo-4,7,10,13-tetraazaheptadecan-2-ylcarbamate
TypeSmall organic molecule
Emp. Form.C30H48N6O10
Mol. Mass.652.7363
SMILESCC(C)C[C@H](NC(=O)[C@@H](NC(=O)[C@H](CCCCN)NC(=O)[C@H](CO)NC(=O)[C@H](CO)NC(=O)OCc1ccccc1)[C@@H](C)O)C=O