Reaction Details
TargetProstate-specific antigen
LigandBDBM50298745
Substrate/Competitorn/a
Meas. Tech.ChEMBL_588029 (CHEMBL1048364)
Ki 43.8±n/a nM
Citation LeBeau, AMBanerjee, SRPomper, MGMease, RCDenmeade, SR Optimization of peptide-based inhibitors of prostate-specific antigen (PSA) as targeted imaging agents for prostate cancer. Bioorg Med Chem17:4888-93 (2009) 
 
Prostate-specific antigen
Name:Prostate-specific antigen
Type:PROTEIN
Mol. Mass.:28747.53
Organism:Homo sapiens (Human)
Description:ChEMBL_959198
Residue:261
BDBM50298745
NameBDBM50298745
Synonyms:CHEMBL583786 | benzyl(2S,5S,8S,11S,14S)-14-formyl-1-hydroxy-8-((R)-1-hydroxyethyl)-5-(hydroxymethyl)-11-isobutyl-16-methyl-3,6,9,12-tetraoxo-4,7,10,13-tetraazaheptadecan-2-ylcarbamate
TypeSmall organic molecule
Emp. Form.C30H47N5O10
Mol. Mass.637.7217
SMILESCC(C)C[C@H](NC(=O)[C@H](CC(C)C)NC(=O)[C@@H](NC(=O)[C@H](CO)NC(=O)[C@H](CO)NC(=O)OCc1ccccc1)[C@@H](C)O)C=O