Reaction Details
TargetProstate-specific antigen
LigandBDBM50298751
Substrate/Competitorn/a
Meas. Tech.ChEMBL_588029 (CHEMBL1048364)
Ki 48.4±n/a nM
Citation LeBeau, AMBanerjee, SRPomper, MGMease, RCDenmeade, SR Optimization of peptide-based inhibitors of prostate-specific antigen (PSA) as targeted imaging agents for prostate cancer. Bioorg Med Chem17:4888-93 (2009) 
 
Prostate-specific antigen
Name:Prostate-specific antigen
Type:PROTEIN
Mol. Mass.:28747.53
Organism:Homo sapiens (Human)
Description:ChEMBL_959198
Residue:261
BDBM50298751
NameBDBM50298751
Synonyms:(5S,8S,11S,14R)-11-(4-aminobutyl)-5,8-bis(hydroxymethyl)-16-methyl-3,6,9,12-tetraoxo-1-phenyl-2-oxa-4,7,10,13-tetraazaheptadecan-14-ylboronic acid | CHEMBL573645
TypeSmall organic molecule
Emp. Form.C25H42BN5O9
Mol. Mass.567.44
SMILESCC(C)C[C@H](NC(=O)[C@H](CCCCN)NC(=O)[C@H](CO)NC(=O)[C@H](CO)NC(=O)OCc1ccccc1)B(O)O