Reaction Details
TargetProstate-specific antigen
LigandBDBM50298753
Substrate/Competitorn/a
Meas. Tech.ChEMBL_588029 (CHEMBL1048364)
Ki 25.3±n/a nM
Citation LeBeau, AMBanerjee, SRPomper, MGMease, RCDenmeade, SR Optimization of peptide-based inhibitors of prostate-specific antigen (PSA) as targeted imaging agents for prostate cancer. Bioorg Med Chem17:4888-93 (2009) 
 
Prostate-specific antigen
Name:Prostate-specific antigen
Type:PROTEIN
Mol. Mass.:28747.53
Organism:Homo sapiens (Human)
Description:ChEMBL_959198
Residue:261
BDBM50298753
NameBDBM50298753
Synonyms:(3S,6S,9S,12R)-9-(3-amino-3-oxopropyl)-3,6-bis(hydroxymethyl)-14-methyl-1-morpholino-1,4,7,10-tetraoxo-2,5,8,11-tetraazapentadecan-12-ylboronic acid | CHEMBL577821
TypeSmall organic molecule
Emp. Form.C21H39BN6O10
Mol. Mass.546.38
SMILESCC(C)C[C@H](NC(=O)[C@H](CCC(N)=O)NC(=O)[C@H](CO)NC(=O)[C@H](CO)NC(=O)N1CCOCC1)B(O)O