Reaction Details
TargetProstate-specific antigen
LigandBDBM50298761
Substrate/Competitorn/a
Meas. Tech.ChEMBL_588029 (CHEMBL1048364)
Ki 4.4±n/a nM
Citation LeBeau, AMBanerjee, SRPomper, MGMease, RCDenmeade, SR Optimization of peptide-based inhibitors of prostate-specific antigen (PSA) as targeted imaging agents for prostate cancer. Bioorg Med Chem17:4888-93 (2009) 
 
Prostate-specific antigen
Name:Prostate-specific antigen
Type:PROTEIN
Mol. Mass.:28747.53
Organism:Homo sapiens (Human)
Description:ChEMBL_959198
Residue:261
BDBM50298761
NameBDBM50298761
Synonyms:CHEMBL574788 | benzyl(2S,5S,8S,11S,14S)-8-(4-aminobutyl)-14-formyl-1-hydroxy-5-(hydroxymethyl)-16-methyl-3,6,9,12-tetraoxo-11-propyl-4,7,10,13-tetraazaheptadecan-2-ylcarbamate
TypeSmall organic molecule
Emp. Form.C31H50N6O9
Mol. Mass.650.7635
SMILESCCC[C@H](NC(=O)[C@H](CCCCN)NC(=O)[C@H](CO)NC(=O)[C@H](CO)NC(=O)OCc1ccccc1)C(=O)N[C@@H](CC(C)C)C=O