Reaction Details
TargetPlasmepsin II
LigandBDBM50209559
Substrate/Competitorn/a
Meas. Tech.ChEMBL_588255 (CHEMBL1050912)
Ki 0.5±n/a nM
Citation Orrling, KMMarzahn, MRGutiérrez-de-Terán, HAqvist, JDunn, BMLarhed, M alpha-Substituted norstatines as the transition-state mimic in inhibitors of multiple digestive vacuole malaria aspartic proteases. Bioorg Med Chem17:5933-49 (2009) 
 
Plasmepsin II
Name:Plasmepsin II
Type:Enzyme
Mol. Mass.:51482.09
Organism:Plasmodium falciparum
Description:P46925
Residue:453
BDBM50209559
NameBDBM50209559
Synonyms:(4R)-3-[(2S,3S)-3-{[(2,6-dimethylphenoxy)acetyl]amino}-2-hydroxy-4-phenylbutanoyl]-N-[(1S,2R)-2-hydroxy-2,3-dihydro-1H-inden-1-yl]-5,5-dimethyl-1,3-thiazolidine-4-carboxamide CHEMBL231522 | KNI-10006
TypeSmall organic molecule
Emp. Form.C35H41N3O6S
Mol. Mass.631.782
SMILESCc1cccc(C)c1OCC(=O)N[C@@H](Cc1ccccc1)[C@H](O)C(=O)N1CSC(C)(C)[C@H]1C(=O)N[C@@H]1[C@H](O)Cc2ccccc12