Reaction Details
TargetMatrix metalloproteinase-16
LigandBDBM50161330
Substrate/Competitorn/a
Meas. Tech.ChEMBL_591606 (CHEMBL1042359)
IC50 51±n/a nM
Citation Nuti, EPanelli, LCasalini, FAvramova, SIOrlandini, ESantamaria, SNencetti, STuccinardi, TMartinelli, ACercignani, GD'Amelio, NMaiocchi, AUggeri, FRossello, A Design, synthesis, biological evaluation, and NMR studies of a new series of arylsulfones as selective and potent matrix metalloproteinase-12 inhibitors. J Med Chem52:6347-61 (2009) 
 
Matrix metalloproteinase-16
Name:Matrix metalloproteinase-16
Type:PROTEIN
Mol. Mass.:69536.76
Organism:Homo sapiens (Human)
Description:ChEMBL_799129
Residue:607
BDBM50161330
NameBDBM50161330
Synonyms:(R)-2-[(Biphenyl-4-sulfonyl)-isopropoxy-amino]-N-hydroxy-3-methyl-butyramide CHEMBL179288
TypeSmall organic molecule
Emp. Form.C20H26N2O5S
Mol. Mass.406.496
SMILESCC(C)ON([C@H](C(C)C)C(=O)NO)S(=O)(=O)c1ccc(cc1)-c1ccccc1