Reaction Details
TargetMatrix metalloproteinase-16
LigandBDBM50299058
Substrate/Competitorn/a
Meas. Tech.ChEMBL_591606 (CHEMBL1042359)
IC50 470±n/a nM
Citation Nuti, EPanelli, LCasalini, FAvramova, SIOrlandini, ESantamaria, SNencetti, STuccinardi, TMartinelli, ACercignani, GD'Amelio, NMaiocchi, AUggeri, FRossello, A Design, synthesis, biological evaluation, and NMR studies of a new series of arylsulfones as selective and potent matrix metalloproteinase-12 inhibitors. J Med Chem52:6347-61 (2009) 
 
Matrix metalloproteinase-16
Name:Matrix metalloproteinase-16
Type:PROTEIN
Mol. Mass.:69536.76
Organism:Homo sapiens (Human)
Description:ChEMBL_799129
Residue:607
BDBM50299058
NameBDBM50299058
Synonyms:(+/-)-2-[2-(Biphenyl-4-sulfonyl)phenyl]N-hydroxy-propionamide | CHEMBL574605
TypeSmall organic molecule
Emp. Form.C21H19NO4S
Mol. Mass.381.445
SMILESCC(C(=O)NO)c1ccccc1S(=O)(=O)c1ccc(cc1)-c1ccccc1