Reaction Details
TargetGlycogen synthase kinase-3 beta
LigandBDBM50299079
Substrate/Competitorn/a
Meas. Tech.ChEMBL_591611 (CHEMBL1042364)
IC50 13±n/a nM
Citation Saitoh, MKunitomo, JKimura, EIwashita, HUno, YOnishi, TUchiyama, NKawamoto, TTanaka, TMol, CDDougan, DRTextor, GPSnell, GPTakizawa, MItoh, FKori, M 2-{3-[4-(Alkylsulfinyl)phenyl]-1-benzofuran-5-yl}-5-methyl-1,3,4-oxadiazole derivatives as novel inhibitors of glycogen synthase kinase-3beta with good brain permeability. J Med Chem52:6270-86 (2009) 
 
Glycogen synthase kinase-3 beta
Name:Glycogen synthase kinase-3 beta
Type:Enzyme
Mol. Mass.:46756.38
Organism:Homo sapiens (Human)
Description:P49841
Residue:420
BDBM50299079
NameBDBM50299079
Synonyms:5-{3-[4-(Methylsulfinyl)phenyl]-1-benzofuran-5-yl}-1,3,4-oxadiazol-2-amine | CHEMBL584976
TypeSmall organic molecule
Emp. Form.C17H13N3O3S
Mol. Mass.339.368
SMILESCS(=O)c1ccc(cc1)-c1coc2ccc(cc12)-c1nnc(N)o1