Reaction Details
TargetGlycogen synthase kinase-3 beta
LigandBDBM50299100
Substrate/Competitorn/a
Meas. Tech.ChEMBL_591611 (CHEMBL1042364)
IC50 790±n/a nM
Citation Saitoh, MKunitomo, JKimura, EIwashita, HUno, YOnishi, TUchiyama, NKawamoto, TTanaka, TMol, CDDougan, DRTextor, GPSnell, GPTakizawa, MItoh, FKori, M 2-{3-[4-(Alkylsulfinyl)phenyl]-1-benzofuran-5-yl}-5-methyl-1,3,4-oxadiazole derivatives as novel inhibitors of glycogen synthase kinase-3beta with good brain permeability. J Med Chem52:6270-86 (2009) 
 
Glycogen synthase kinase-3 beta
Name:Glycogen synthase kinase-3 beta
Type:Enzyme
Mol. Mass.:46756.38
Organism:Homo sapiens (Human)
Description:P49841
Residue:420
BDBM50299100
NameBDBM50299100
Synonyms:2-Methyl-5-{3-[4-(methylsulfinyl)phenyl]-1-benzothiophen-5-yl}-1,3,4-oxadiazole | CHEMBL573266
TypeSmall organic molecule
Emp. Form.C20H16O2S2
Mol. Mass.352.47
SMILESCc1ccc(o1)-c1ccc2scc(-c3ccc(cc3)S(C)=O)c2c1