Reaction Details
TargetEgl nine homolog 1
LigandBDBM50197063
Substrate/Competitorn/a
Meas. Tech.ChEMBL_591852 (CHEMBL1045056)
IC50 18000±n/a nM
Citation Mecinovic, JLoenarz, CChowdhury, RSchofield, CJ 2-Oxoglutarate analogue inhibitors of prolyl hydroxylase domain 2. Bioorg Med Chem Lett19:6192-5 (2009) 
 
Egl nine homolog 1
Name:Egl nine homolog 1
Type:Protein
Mol. Mass.:46035.59
Organism:Homo sapiens (Human)
Description:Q9GZT9
Residue:426
BDBM50197063
NameBDBM50197063
Synonyms:4,6-dioxoheptanoic acid succinylacetone
TypeSmall organic molecule
Emp. Form.C7H10O4
Mol. Mass.158.1519
SMILESCC(=O)CC(=O)CCC(O)=O