Reaction Details
TargetKappa-type opioid receptor
LigandBDBM50299213
Substrate/Competitorn/a
Meas. Tech.ChEMBL_592546 (CHEMBL1046753)
Ki 69±n/a nM
Citation Purington, LCPogozheva, IDTraynor, JRMosberg, HI Pentapeptides displaying mu opioid receptor agonist and delta opioid receptor partial agonist/antagonist properties. J Med Chem52:7724-31 (2009) 
 
Kappa-type opioid receptor
Name:Kappa-type opioid receptor
Type:G Protein-Coupled Receptor (GPCR)
Mol. Mass.:42648.76
Organism:Homo sapiens (Human)
Description:P41145
Residue:380
BDBM50299213
NameBDBM50299213
Synonyms:(5R,8S,11S,14S)-14-((S)-2-amino-3-(4-hydroxyphenyl)propanamido)-8-benzyl-11-(naphthalen-2-ylmethyl)-7,10,13-trioxo-1,3-dithia-6,9,12-triazacyclopentadecane-5-carboxamide | CHEMBL583275
TypeSmall organic molecule
Emp. Form.C38H42N6O6S2
Mol. Mass.742.907
SMILESN[C@@H](Cc1ccc(O)cc1)C(=O)N[C@@H]1CSCSC[C@H](NC(=O)[C@H](Cc2ccccc2)NC(=O)[C@H](Cc2ccc3ccccc3c2)NC1=O)C(N)=O