Reaction Details
TargetDelta-type opioid receptor
LigandBDBM50299214
Substrate/Competitorn/a
Meas. Tech.ChEMBL_592545 (CHEMBL1046752)
Ki 55±n/a nM
Citation Purington, LCPogozheva, IDTraynor, JRMosberg, HI Pentapeptides displaying mu opioid receptor agonist and delta opioid receptor partial agonist/antagonist properties. J Med Chem52:7724-31 (2009) 
 
Delta-type opioid receptor
Name:Delta-type opioid receptor
Type:G Protein-Coupled Receptor (GPCR)
Mol. Mass.:40465.04
Organism:Rattus norvegicus (rat)
Description:Competition binding assays were using CHO-K1 cell membranes expressing the opioid receptor.
Residue:372
BDBM50299214
NameBDBM50299214
Synonyms:(4R,7S,10S,13S)-13-((S)-2-amino-3-(4-hydroxyphenyl)propanamido)-7-benzyl-10-(naphthalen-2-ylmethyl)-6,9,12-trioxo-1,2-dithia-5,8,11-triazacyclotetradecane-4-carboxamide | CHEMBL572524
TypeSmall organic molecule
Emp. Form.C37H40N6O6S2
Mol. Mass.728.88
SMILESN[C@@H](Cc1ccc(O)cc1)C(=O)N[C@@H]1CSSC[C@H](NC(=O)[C@H](Cc2ccccc2)NC(=O)[C@H](Cc2ccc3ccccc3c2)NC1=O)C(N)=O