Reaction Details
TargetMu-type opioid receptor
LigandBDBM50299212
Substrate/Competitorn/a
Meas. Tech.ChEMBL_592544 (CHEMBL1046751)
Ki 2.5±n/a nM
Citation Purington, LCPogozheva, IDTraynor, JRMosberg, HI Pentapeptides displaying mu opioid receptor agonist and delta opioid receptor partial agonist/antagonist properties. J Med Chem52:7724-31 (2009) 
 
Mu-type opioid receptor
Name:Mu-type opioid receptor
Type:G Protein-Coupled Receptor (GPCR)
Mol. Mass.:44503.11
Organism:Rattus norvegicus (rat)
Description:Competition binding assays were carried out using membrane preparations from transfected HN9.10 cells that constitutively expressed the mu opioid receptor.
Residue:398
BDBM50299212
NameBDBM50299212
Synonyms:(4R,7S,10S,13S)-13-((S)-2-amino-3-(4-hydroxyphenyl)propanamido)-10-benzyl-7-(naphthalen-1-ylmethyl)-6,9,12-trioxo-1,2-dithia-5,8,11-triazacyclotetradecane-4-carboxamide | CHEMBL583276
TypeSmall organic molecule
Emp. Form.C37H40N6O6S2
Mol. Mass.728.88
SMILESN[C@@H](Cc1ccc(O)cc1)C(=O)N[C@@H]1CSSC[C@H](NC(=O)[C@H](Cc2cccc3ccccc23)NC(=O)[C@H](Cc2ccccc2)NC1=O)C(N)=O