Reaction Details
TargetDelta-type opioid receptor
LigandBDBM50299209
Substrate/Competitorn/a
Meas. Tech.ChEMBL_592556 (CHEMBL1046763)
EC50 36±n/a nM
Citation Purington, LCPogozheva, IDTraynor, JRMosberg, HI Pentapeptides displaying mu opioid receptor agonist and delta opioid receptor partial agonist/antagonist properties. J Med Chem52:7724-31 (2009) 
 
Delta-type opioid receptor
Name:Delta-type opioid receptor
Type:G Protein-Coupled Receptor (GPCR)
Mol. Mass.:40465.04
Organism:Rattus norvegicus (rat)
Description:Competition binding assays were using CHO-K1 cell membranes expressing the opioid receptor.
Residue:372
BDBM50299209
NameBDBM50299209
Synonyms:(5R,8S,11S,14S)-14-((S)-2-amino-3-(4-hydroxyphenyl)propanamido)-11-benzyl-8-(naphthalen-2-ylmethyl)-7,10,13-trioxo-1,3-dithia-6,9,12-triazacyclopentadecane-5-carboxamide | CHEMBL572525
TypeSmall organic molecule
Emp. Form.C38H42N6O6S2
Mol. Mass.742.907
SMILESN[C@@H](Cc1ccc(O)cc1)C(=O)N[C@@H]1CSCSC[C@H](NC(=O)[C@H](Cc2ccc3ccccc3c2)NC(=O)[C@H](Cc2ccccc2)NC1=O)C(N)=O