Reaction Details
TargetEphrin type-B receptor 1
LigandBDBM50299218
Substrate/Competitorn/a
Meas. Tech.ChEMBL_592570 (CHEMBL1046777)
IC50 1.1±n/a nM
Citation Lafleur, KHuang, DZhou, TCaflisch, ANevado, C Structure-based optimization of potent and selective inhibitors of the tyrosine kinase erythropoietin producing human hepatocellular carcinoma receptor B4 (EphB4). J Med Chem52:6433-46 (2009) 
 
Ephrin type-B receptor 1
Name:Ephrin type-B receptor 1
Type:Enzyme Catalytic Domain
Mol. Mass.:109882.53
Organism:Homo sapiens (Human)
Description:EPH receptor B1 EPHB1 HUMAN::P54762
Residue:984
BDBM50299218
NameBDBM50299218
Synonyms:8-(2-Methoxyphenyl)-1-methyl-7-(2'-methyl-5'-hydroxyphenyl-1H-imidazo[2,1-f]purine-2,4(3H,8H)-dione Cpd66
TypeSmall organic molecule
Emp. Form.C22H19N5O4
Mol. Mass.417.4174
SMILESCOc1ccccc1-n1c(cn2c1nc1n(C)c(=O)[nH]c(=O)c21)-c1cc(O)ccc1C